Reaction Details
TargetAcetylcholinesterase
LigandBDBM10404
Substrate/Competitorn/a
Meas. Tech.ChEMBL_939334 (CHEMBL2327469)
Ki 1060±n/a nM
Citation Vanzolini, KLVieira, LCCorrêa, AGCardoso, CLCass, QB Acetylcholinesterase immobilized capillary reactors-tandem mass spectrometry: an on-flow tool for ligand screening. J Med Chem56:2038-44 (2013) 
 
Acetylcholinesterase
Name:Acetylcholinesterase
Type:Enzyme
Mol. Mass.:71812.79
Organism:Electrophorus electricus (Electric eel)
Description:n/a
Residue:633
BDBM10404
NameBDBM10404
Synonyms:(1S,12S,14R)-9-methoxy-4-methyl-11-oxa-4-azatetracyclo[8.6.1.0^{1,12}.0^{6,17}]heptadeca-6,8,10(17),15-tetraen-14-ol GALANTAMINE HYDROBROMIDE Galanthamine Lycoremine Nivaline Reminyl US9586925, Galantamine | galantamine
TypeSmall organic molecule
Emp. Form.C17H21NO3
Mol. Mass.287.3535
SMILESCOc1ccc2CN(C)CC[C@@]34C=C[C@H](O)C[C@@H]3Oc1c24