Reaction Details
TargetUbiquitin-like modifier-activating enzyme 6
LigandBDBM50427035
Substrate/Competitorn/a
Meas. Tech.ChEMBL_939704 (CHEMBL2328929)
IC50 920±n/a nM
Citation da Silva, SRPaiva, SLLukkarila, JLGunning, PT Exploring a new frontier in cancer treatment: targeting the ubiquitin and ubiquitin-like activating enzymes. J Med Chem56:2165-77 (2013) 
 
Ubiquitin-like modifier-activating enzyme 6
Name:Ubiquitin-like modifier-activating enzyme 6
Type:PROTEIN
Mol. Mass.:117960.02
Organism:Homo sapiens (Human)
Description:ChEMBL_939704
Residue:1052
BDBM50427035
NameBDBM50427035
Synonyms:CHEMBL2017005
TypeSmall organic molecule
Emp. Form.C19H22N6O6S
Mol. Mass.462.48
SMILESNS(=O)(=O)OC[C@H]1O[C@H]([C@H](O)[C@@H]1O)n1cnc2c(N[C@H]3CCc4ccccc34)ncnc12