Reaction Details
TargetDelta-type opioid receptor
LigandBDBM50268462
Substrate/Competitorn/a
Meas. Tech.ChEMBL_939910 (CHEMBL2327132)
Ki 4150±n/a nM
Citation Carroll, FICarlezon, WA Development of¿ opioid receptor antagonists. J Med Chem56:2178-95 (2013) 
 
Delta-type opioid receptor
Name:Delta-type opioid receptor
Type:Enzyme Catalytic Domain
Mol. Mass.:40577.25
Organism:MOUSE
Description:P32300
Residue:372
BDBM50268462
NameBDBM50268462
Synonyms:CHEMBL506616 | c[L-Phe-D-pro-L-Phe-L-trp]
TypeSmall organic molecule
Emp. Form.C34H35N5O4
Mol. Mass.577.6728
SMILESO=C1N[C@@H](Cc2ccccc2)C(=O)N[C@@H](Cc2c[nH]c3ccccc23)C(=O)N[C@@H](Cc2ccccc2)C(=O)N2CCC[C@H]12