Reaction Details
TargetKappa-type opioid receptor
LigandBDBM50268462
Substrate/Competitorn/a
Meas. Tech.ChEMBL_939911 (CHEMBL2327133)
Ki 35±n/a nM
Citation Carroll, FICarlezon, WA Development of¿ opioid receptor antagonists. J Med Chem56:2178-95 (2013) 
 
Kappa-type opioid receptor
Name:Kappa-type opioid receptor
Type:G Protein-Coupled Receptor (GPCR)
Mol. Mass.:42692.90
Organism:Rattus norvegicus (rat)
Description:P34975
Residue:380
BDBM50268462
NameBDBM50268462
Synonyms:CHEMBL506616 | c[L-Phe-D-pro-L-Phe-L-trp]
TypeSmall organic molecule
Emp. Form.C34H35N5O4
Mol. Mass.577.6728
SMILESO=C1N[C@@H](Cc2ccccc2)C(=O)N[C@@H](Cc2c[nH]c3ccccc23)C(=O)N[C@@H](Cc2ccccc2)C(=O)N2CCC[C@H]12