Reaction Details
TargetMu-type opioid receptor
LigandBDBM50358171
Substrate/Competitorn/a
Meas. Tech.ChEMBL_939900 (CHEMBL2327122)
Ki 16±n/a nM
Citation Carroll, FICarlezon, WA Development of¿ opioid receptor antagonists. J Med Chem56:2178-95 (2013) 
 
Mu-type opioid receptor
Name:Mu-type opioid receptor
Type:G Protein-Coupled Receptor (GPCR)
Mol. Mass.:44789.51
Organism:Homo sapiens (Human)
Description:P35372
Residue:400
BDBM50358171
NameBDBM50358171
Synonyms:CHEMBL1921847
TypeSmall organic molecule
Emp. Form.C26H27FN2O2
Mol. Mass.418.5032
SMILESCc1cc(C)cc(c1)[C@@H]1CCCN1Cc1ccc(Oc2ccc(cc2F)C(N)=O)cc1