Reaction Details
TargetC-C chemokine receptor type 1
LigandBDBM50427065
Substrate/Competitorn/a
Meas. Tech.ChEMBL_940291 (CHEMBL2328793)
IC50 0.800000±n/a nM
Citation Pennell, AMAggen, JBSen, SChen, WXu, YSullivan, ELi, LGreenman, KCharvat, THansen, DDairaghi, DJWright, JJZhang, P 1-(4-Phenylpiperazin-1-yl)-2-(1H-pyrazol-1-yl)ethanones as novel CCR1 antagonists. Bioorg Med Chem Lett23:1228-31 (2013) 
 
C-C chemokine receptor type 1
Name:C-C chemokine receptor type 1
Type:Enzyme
Mol. Mass.:41180.69
Organism:Homo sapiens (Human)
Description:P32246
Residue:355
BDBM50427065
NameBDBM50427065
Synonyms:CHEMBL2322875
TypeSmall organic molecule
Emp. Form.C18H19Cl2F3N4O2
Mol. Mass.451.27
SMILESCOc1cc(ccc1Cl)N1CCN(CC1)C(=O)Cn1nc(c(Cl)c1C)C(F)(F)F