Reaction Details
TargetC-C chemokine receptor type 1
LigandBDBM50427086
Substrate/Competitorn/a
Meas. Tech.ChEMBL_940424 (CHEMBL2329311)
IC50 10.0±n/a nM
Citation Pennell, AMAggen, JBSen, SChen, WXu, YSullivan, ELi, LGreenman, KCharvat, THansen, DDairaghi, DJWright, JJZhang, P 1-(4-Phenylpiperazin-1-yl)-2-(1H-pyrazol-1-yl)ethanones as novel CCR1 antagonists. Bioorg Med Chem Lett23:1228-31 (2013) 
 
C-C chemokine receptor type 1
Name:C-C chemokine receptor type 1
Type:Enzyme
Mol. Mass.:41180.69
Organism:Homo sapiens (Human)
Description:P32246
Residue:355
BDBM50427086
NameBDBM50427086
Synonyms:CHEMBL2322867
TypeSmall organic molecule
Emp. Form.C18H19Cl2F3N4O3
Mol. Mass.467.27
SMILESCOc1cc(ccc1Cl)N1CCN(CC1)C(=O)Cn1nc(c(Cl)c1CO)C(F)(F)F