Reaction Details
TargetC-C chemokine receptor type 1
LigandBDBM50427096
Substrate/Competitorn/a
Meas. Tech.ChEMBL_940424 (CHEMBL2329311)
IC50 19±n/a nM
Citation Pennell, AMAggen, JBSen, SChen, WXu, YSullivan, ELi, LGreenman, KCharvat, THansen, DDairaghi, DJWright, JJZhang, P 1-(4-Phenylpiperazin-1-yl)-2-(1H-pyrazol-1-yl)ethanones as novel CCR1 antagonists. Bioorg Med Chem Lett23:1228-31 (2013) 
 
C-C chemokine receptor type 1
Name:C-C chemokine receptor type 1
Type:Enzyme
Mol. Mass.:41180.69
Organism:Homo sapiens (Human)
Description:P32246
Residue:355
BDBM50427096
NameBDBM50427096
Synonyms:CHEMBL2322857
TypeSmall organic molecule
Emp. Form.C18H20ClF3N4O2
Mol. Mass.416.825
SMILESCOc1cc(ccc1Cl)N1CCN(CC1)C(=O)Cn1nc(cc1C)C(F)(F)F