Reaction Details
TargetBeta-1,3-galactosyltransferase 1
LigandBDBM50427121
Substrate/Competitorn/a
Meas. Tech.ChEMBL_940442 (CHEMBL2329440)
IC50 440000±n/a nM
Citation Gao, YVlahakis, JZSzarek, WABrockhausen, I Selective inhibition of glycosyltransferases by bivalent imidazolium salts. Bioorg Med Chem21:1305-11 (2013) 
 
Beta-1,3-galactosyltransferase 1
Name:Beta-1,3-galactosyltransferase 1
Type:PROTEIN
Mol. Mass.:38012.77
Organism:Homo sapiens (Human)
Description:ChEMBL_940442
Residue:326
BDBM50427121
NameBDBM50427121
Synonyms:CHEMBL2323429 | CHEMBL2323430
TypeSmall organic molecule
Emp. Form.C28H52N4
Mol. Mass.444.7382
SMILESC[n+]1ccn(CCCCCCCCCCCCCCCCCCCCn2cc[n+](C)c2)c1