Reaction Details
TargetO-acetylserine sulfhydrylase
LigandBDBM50427253
Substrate/Competitorn/a
Meas. Tech.ChEMBL_938536 (CHEMBL2327220)
IC50 30300±n/a nM
Citation Jean Kumar, VUPoyraz, ÖSaxena, SSchnell, RYogeeswari, PSchneider, GSriram, D Discovery of novel inhibitors targeting the Mycobacterium tuberculosis O-acetylserine sulfhydrylase (CysK1) using virtual high-throughput screening. Bioorg Med Chem Lett23:1182-6 (2013) 
 
O-acetylserine sulfhydrylase
Name:O-acetylserine sulfhydrylase
Type:PROTEIN
Mol. Mass.:32747.29
Organism:Mycobacterium tuberculosis
Description:ChEMBL_978239
Residue:310
BDBM50427253
NameBDBM50427253
Synonyms:CHEMBL2325124
TypeSmall organic molecule
Emp. Form.C14H8N6O5S2
Mol. Mass.404.381
SMILES[O-][N+](=O)c1cn2c3NC(=S)NC(c4ccccc4[N+]([O-])=O)c3c(=O)nc2s1