Reaction Details
TargetO-acetylserine sulfhydrylase
LigandBDBM50427254
Substrate/Competitorn/a
Meas. Tech.ChEMBL_938536 (CHEMBL2327220)
IC50 22700±n/a nM
Citation Jean Kumar, VUPoyraz, ÖSaxena, SSchnell, RYogeeswari, PSchneider, GSriram, D Discovery of novel inhibitors targeting the Mycobacterium tuberculosis O-acetylserine sulfhydrylase (CysK1) using virtual high-throughput screening. Bioorg Med Chem Lett23:1182-6 (2013) 
 
O-acetylserine sulfhydrylase
Name:O-acetylserine sulfhydrylase
Type:PROTEIN
Mol. Mass.:32747.29
Organism:Mycobacterium tuberculosis
Description:ChEMBL_978239
Residue:310
BDBM50427254
NameBDBM50427254
Synonyms:CHEMBL2325133
TypeSmall organic molecule
Emp. Form.C15H11N5O4S2
Mol. Mass.389.409
SMILESCOc1ccc(cc1)C1NC(=S)Nc2c1c(=O)nc1sc(cn21)[N+]([O-])=O