Reaction Details
TargetKinesin-like protein KIF11
LigandBDBM23802
Substrate/Competitorn/a
Meas. Tech.ChEMBL_940910 (CHEMBL2330556)
Ki 245±n/a nM
Citation Good, JAWang, FRath, OKaan, HYTalapatra, SKPodgórski, DMacKay, SPKozielski, F Optimized S-trityl-L-cysteine-based inhibitors of kinesin spindle protein with potent in vivo antitumor activity in lung cancer xenograft models. J Med Chem56:1878-93 (2013) 
 
Kinesin-like protein KIF11
Name:Kinesin-like protein KIF11
Type:PROTEIN
Mol. Mass.:119138.97
Organism:Homo sapiens (Human)
Description:ChEMBL_1457426
Residue:1056
BDBM23802
NameBDBM23802
Synonyms:2-[(triphenylmethyl)sulfanyl]ethan-1-amine | Triphenylmethyl-containing compound, 31
TypeSmall organic molecule
Emp. Form.C21H21NS
Mol. Mass.319.463
SMILESNCCSC(c1ccccc1)(c1ccccc1)c1ccccc1