Reaction Details
TargetKinesin-like protein KIF11
LigandBDBM50427260
Substrate/Competitorn/a
Meas. Tech.ChEMBL_940910 (CHEMBL2330556)
Ki 17±n/a nM
Citation Good, JAWang, FRath, OKaan, HYTalapatra, SKPodgórski, DMacKay, SPKozielski, F Optimized S-trityl-L-cysteine-based inhibitors of kinesin spindle protein with potent in vivo antitumor activity in lung cancer xenograft models. J Med Chem56:1878-93 (2013) 
 
Kinesin-like protein KIF11
Name:Kinesin-like protein KIF11
Type:PROTEIN
Mol. Mass.:119138.97
Organism:Homo sapiens (Human)
Description:ChEMBL_1457426
Residue:1056
BDBM50427260
NameBDBM50427260
Synonyms:2-((4-Ethoxyphenyl)Diphenylmethylthio)Ethanamine | CHEMBL2325430
TypeSmall organic molecule
Emp. Form.C23H25NOS
Mol. Mass.363.516
SMILESCCOc1ccc(cc1)C(SCCN)(c1ccccc1)c1ccccc1