Reaction Details
TargetKinesin-like protein KIF11
LigandBDBM50427274
Substrate/Competitorn/a
Meas. Tech.ChEMBL_938549 (CHEMBL2327388)
Ki 19±n/a nM
Citation Good, JAWang, FRath, OKaan, HYTalapatra, SKPodgórski, DMacKay, SPKozielski, F Optimized S-trityl-L-cysteine-based inhibitors of kinesin spindle protein with potent in vivo antitumor activity in lung cancer xenograft models. J Med Chem56:1878-93 (2013) 
 
Kinesin-like protein KIF11
Name:Kinesin-like protein KIF11
Type:PROTEIN
Mol. Mass.:119138.97
Organism:Homo sapiens (Human)
Description:ChEMBL_1457426
Residue:1056
BDBM50427274
NameBDBM50427274
Synonyms:CHEMBL2325410
TypeSmall organic molecule
Emp. Form.C24H25NO2S
Mol. Mass.391.526
SMILESCc1ccc(cc1C)C(SC[C@H](N)C(O)=O)(c1ccccc1)c1ccccc1