Reaction Details
TargetCannabinoid receptor 2
LigandBDBM50427439
Substrate/Competitorn/a
Meas. Tech.ChEMBL_941210 (CHEMBL2329721)
Ki 2745±n/a nM
Citation Yang, PWang, LFeng, RAlmehizia, AATong, QMyint, KZOuyang, QAlqarni, MHWang, LXie, XQ Novel triaryl sulfonamide derivatives as selective cannabinoid receptor 2 inverse agonists and osteoclast inhibitors: discovery, optimization, and biological evaluation. J Med Chem56:2045-58 (2013) 
 
Cannabinoid receptor 2
Name:Cannabinoid receptor 2
Type:G Protein-Coupled Receptor (GPCR)
Mol. Mass.:39690.94
Organism:Homo sapiens (Human)
Description:P34972
Residue:360
BDBM50427439
NameBDBM50427439
Synonyms:CHEMBL2326034
TypeSmall organic molecule
Emp. Form.C25H38N2O2S
Mol. Mass.430.646
SMILESCCCCCCCN(Cc1ccc(cc1)N(CC)CC)S(=O)(=O)c1ccc(C)cc1