Reaction Details
TargetCannabinoid receptor 2
LigandBDBM50427422
Substrate/Competitorn/a
Meas. Tech.ChEMBL_941209 (CHEMBL2329720)
EC50 16±n/a nM
Citation Yang, PWang, LFeng, RAlmehizia, AATong, QMyint, KZOuyang, QAlqarni, MHWang, LXie, XQ Novel triaryl sulfonamide derivatives as selective cannabinoid receptor 2 inverse agonists and osteoclast inhibitors: discovery, optimization, and biological evaluation. J Med Chem56:2045-58 (2013) 
 
Cannabinoid receptor 2
Name:Cannabinoid receptor 2
Type:G Protein-Coupled Receptor (GPCR)
Mol. Mass.:39690.94
Organism:Homo sapiens (Human)
Description:P34972
Residue:360
BDBM50427422
NameBDBM50427422
Synonyms:CHEMBL2326288
TypeSmall organic molecule
Emp. Form.C24H27ClN2O3S
Mol. Mass.459.001
SMILESCCN(CC)c1ccc(CN(c2ccc(Cl)cc2)S(=O)(=O)c2ccc(OC)cc2)cc1