Reaction Details
TargetCannabinoid receptor 1
LigandBDBM50427410
Substrate/Competitorn/a
Meas. Tech.ChEMBL_941211 (CHEMBL2329722)
Ki 3365±n/a nM
Citation Yang, PWang, LFeng, RAlmehizia, AATong, QMyint, KZOuyang, QAlqarni, MHWang, LXie, XQ Novel triaryl sulfonamide derivatives as selective cannabinoid receptor 2 inverse agonists and osteoclast inhibitors: discovery, optimization, and biological evaluation. J Med Chem56:2045-58 (2013) 
 
Cannabinoid receptor 1
Name:Cannabinoid receptor 1
Type:G Protein-Coupled Receptor (GPCR)
Mol. Mass.:52868.96
Organism:Homo sapiens (Human)
Description:P21554
Residue:472
BDBM50427410
NameBDBM50427410
Synonyms:CHEMBL2326300
TypeSmall organic molecule
Emp. Form.C27H34N2O2S
Mol. Mass.450.636
SMILESCCN(CC)c1ccc(CN(c2ccc(C)cc2)S(=O)(=O)c2ccc(cc2)C(C)C)cc1