Reaction Details
TargetDelta-type opioid receptor
LigandBDBM50427563
Substrate/Competitorn/a
Meas. Tech.ChEMBL_941602 (CHEMBL2330684)
Ki 180±n/a nM
Citation Mosberg, HIYeomans, LHarland, AABender, AMSobczyk-Kojiro, KAnand, JPClark, MJJutkiewicz, EMTraynor, JR Opioid peptidomimetics: leads for the design of bioavailable mixed efficacyµ opioid receptor (MOR) agonist/d opioid receptor (DOR) antagonist ligands. J Med Chem56:2139-49 (2013) 
 
Delta-type opioid receptor
Name:Delta-type opioid receptor
Type:G Protein-Coupled Receptor (GPCR)
Mol. Mass.:40465.04
Organism:Rattus norvegicus (rat)
Description:Competition binding assays were using CHO-K1 cell membranes expressing the opioid receptor.
Residue:372
BDBM50427563
NameBDBM50427563
Synonyms:CHEMBL2322567
TypeSmall organic molecule
Emp. Form.C30H35N3O2
Mol. Mass.469.6178
SMILESCc1cc(O)cc(C)c1C[C@H](N)C(=O)N[C@H]1CCNc2ccc(CC3Cc4ccccc4C3)cc12