Reaction Details
TargetKappa-type opioid receptor
LigandBDBM50427558
Substrate/Competitorn/a
Meas. Tech.ChEMBL_941600 (CHEMBL2330682)
Ki 25±n/a nM
Citation Mosberg, HIYeomans, LHarland, AABender, AMSobczyk-Kojiro, KAnand, JPClark, MJJutkiewicz, EMTraynor, JR Opioid peptidomimetics: leads for the design of bioavailable mixed efficacyµ opioid receptor (MOR) agonist/d opioid receptor (DOR) antagonist ligands. J Med Chem56:2139-49 (2013) 
 
Kappa-type opioid receptor
Name:Kappa-type opioid receptor
Type:G Protein-Coupled Receptor (GPCR)
Mol. Mass.:42648.76
Organism:Homo sapiens (Human)
Description:P41145
Residue:380
BDBM50427558
NameBDBM50427558
Synonyms:CHEMBL2322560
TypeSmall organic molecule
Emp. Form.C28H33N3O2
Mol. Mass.443.5805
SMILESCc1cc(O)cc(C)c1C[C@H](N)C(=O)N[C@@H]1CCNc2ccc(CCc3ccccc3)cc12