Reaction Details
TargetMelanocortin receptor 4
LigandBDBM50339348
Substrate/Competitorn/a
Meas. Tech.ChEMBL_941841 (CHEMBL2329832)
EC50 0.170000±n/a nM
Citation Singh, ADirain, MWitek, RRocca, JREdison, ASHaskell-Luevano, C Structure-activity relationships of peptides incorporating a bioactive reverse-turn heterocycle at the melanocortin receptors: identification of a 5800-fold mouse melanocortin-3 receptor (mMC3R) selective antagonist/partial agonist versus the mouse melanocortin-4 receptor (mMC4R). J Med Chem56:2747-63 (2013) 
 
Melanocortin receptor 4
Name:Melanocortin receptor 4
Type:PROTEIN
Mol. Mass.:36964.43
Organism:Mus musculus
Description:ChEMBL_1498850
Residue:332
BDBM50339348
NameBDBM50339348
Synonyms:(4R,7S,10S,13S,16S,19S,22R,25S,28R)-25-((1H-imidazol-4-yl)methyl)-16-((1H-indol-3-yl)methyl)-13-(2-amino-2-oxoethyl)-N-((S)-1-amino-3-(4-hydroxyphenyl)-1-oxopropan-2-yl)-28-((S)-2-amino-3-(4-hydroxyphenyl)propanamido)-7,22-dibenzyl-19-(3-guanidinopropyl)-10-methyl-6,9,12,15,18,21,24,27-octaoxo-1,2-dithia-5,8,11,14,17,20,23,26-octaazacyclononacosane-4-carboxamide | CHEMBL1688107
TypeSmall organic molecule
Emp. Form.C72H87N19O14S2
Mol. Mass.1506.71
SMILESC[C@@H]1NC(=O)[C@H](CC(N)=O)NC(=O)[C@H](Cc2c[nH]c3ccccc23)NC(=O)[C@H](CCCN=C(N)N)NC(=O)[C@@H](Cc2ccccc2)NC(=O)[C@H](Cc2cnc[nH]2)NC(=O)[C@H](CSSC[C@H](NC(=O)[C@H](Cc2ccccc2)NC1=O)C(=O)N[C@@H](Cc1ccc(O)cc1)C(N)=O)NC(=O)[C@@H](N)Cc1ccc(O)cc1