Reaction Details
TargetInsulin-degrading enzyme
LigandBDBM50427698
Substrate/Competitorn/a
Meas. Tech.ChEMBL_941897 (CHEMBL2329963)
Ki 410±n/a nM
Citation Abdul-Hay, SOLane, ALCaulfield, TRClaussin, CBertrand, JMasson, AChoudhry, SFauq, AHMaharvi, GMLeissring, MA Optimization of peptide hydroxamate inhibitors of insulin-degrading enzyme reveals marked substrate-selectivity. J Med Chem56:2246-55 (2013) 
 
Insulin-degrading enzyme
Name:Insulin-degrading enzyme
Type:Enzyme Catalytic Domain
Mol. Mass.:117968.59
Organism:Homo sapiens (Human)
Description:P14735
Residue:1019
BDBM50427698
NameBDBM50427698
Synonyms:CHEMBL2324206
TypeSmall organic molecule
Emp. Form.C57H57N7O12S
Mol. Mass.1064.167
SMILESCC(=O)N[C@@H](CCC(=O)NCCNc1cccc2c(cccc12)S(O)(=O)=O)C(=O)N[C@H](Cc1ccc(O)cc1)C(=O)N([C@H](Cc1ccccc1)C(=O)N[C@H](Cc1ccc2ccccc2c1)C(=O)NO)C(=O)c1ccccc1