Reaction Details
TargetPoly [ADP-ribose] polymerase tankyrase-2
LigandBDBM50427989
Substrate/Competitorn/a
Meas. Tech.ChEMBL_941156 (CHEMBL2330982)
IC50 25±n/a nM
Citation Voronkov, AHolsworth, DDWaaler, JWilson, SREkblad, BPerdreau-Dahl, HDinh, HDrewes, GHopf, CMorth, JPKrauss, S Structural basis and SAR for G007-LK, a lead stage 1,2,4-triazole based specific tankyrase 1/2 inhibitor. J Med Chem56:3012-23 (2013) 
 
Poly [ADP-ribose] polymerase tankyrase-2
Name:Poly [ADP-ribose] polymerase tankyrase-2
Type:Enzyme
Mol. Mass.:126937.16
Organism:Homo sapiens (Human)
Description:Q9H2K2
Residue:1166
BDBM50427989
NameBDBM50427989
Synonyms:CHEMBL2325503
TypeSmall organic molecule
Emp. Form.C25H16ClN7O3S
Mol. Mass.529.958
SMILESCS(=O)(=O)c1ccc(nc1)-c1nnc(\C=C\c2nnc(o2)-c2ccc(cc2)C#N)n1-c1ccccc1Cl