Reaction Details
TargetNeuraminidase
LigandBDBM4706
Substrate/Competitorn/a
Meas. Tech.ChEMBL_941624 (CHEMBL2330706)
IC50 170000±n/a nM
Citation Zhang, YAlbohy, AZou, YSmutova, VPshezhetsky, AVCairo, CW Identification of selective inhibitors for human neuraminidase isoenzymes using C4,C7-modified 2-deoxy-2,3-didehydro-N-acetylneuraminic acid (DANA) analogues. J Med Chem56:2948-58 (2013) 
 
Neuraminidase
Name:Neuraminidase
Synonyms:nanH
Type:PROTEIN
Mol. Mass.:88686.49
Organism:Vibrio cholerae
Description:ChEMBL_941624
Residue:807
BDBM4706
NameBDBM4706
TypeSmall organic molecule
Emp. Form.C11H17NO8
Mol. Mass.291.2546
SMILESCC(=O)N[C@@H]1[C@@H](O)C=C(O[C@H]1[C@H](O)[C@H](O)CO)C(O)=O