Reaction Details
TargetSialidase-4
LigandBDBM50428076
Substrate/Competitorn/a
Meas. Tech.ChEMBL_941546 (CHEMBL2330586)
IC50>1000000±n/a nM
Citation Zhang, YAlbohy, AZou, YSmutova, VPshezhetsky, AVCairo, CW Identification of selective inhibitors for human neuraminidase isoenzymes using C4,C7-modified 2-deoxy-2,3-didehydro-N-acetylneuraminic acid (DANA) analogues. J Med Chem56:2948-58 (2013) 
 
Sialidase-4
Name:Sialidase-4
Type:PROTEIN
Mol. Mass.:51579.82
Organism:Homo sapiens (Human)
Description:ChEMBL_960637
Residue:484
BDBM50428076
NameBDBM50428076
Synonyms:CHEMBL2323563
TypeSmall organic molecule
Emp. Form.C16H20N2O5
Mol. Mass.320.3404
SMILESCC(=O)N[C@@H]1[C@@H](O)C=C(O[C@H]1CNCc1ccccc1)C(O)=O