Reaction Details
TargetSialidase-2
LigandBDBM50063303
Substrate/Competitorn/a
Meas. Tech.ChEMBL_941548 (CHEMBL2330588)
IC50 44000±n/a nM
Citation Zhang, YAlbohy, AZou, YSmutova, VPshezhetsky, AVCairo, CW Identification of selective inhibitors for human neuraminidase isoenzymes using C4,C7-modified 2-deoxy-2,3-didehydro-N-acetylneuraminic acid (DANA) analogues. J Med Chem56:2948-58 (2013) 
 
Sialidase-2
Name:Sialidase-2
Type:PROTEIN
Mol. Mass.:42256.20
Organism:Homo sapiens (Human)
Description:ChEMBL_960638
Residue:380
BDBM50063303
NameBDBM50063303
Synonyms:(2R,3R,4S)-3-acetamido-4-amino-2-((1R,2R)-1,2,3-trihydroxypropyl)-3,4-dihydro-2H-pyran-6-carboxylic acid (4S,5R,6R)-5-acetamido-4-amino-6-((1R,2R)-1,2,3-trihydroxypropyl)-5,6-dihydro-4H-pyran-2-carboxylic acid CHEMBL52270
TypeSmall organic molecule
Emp. Form.C11H18N2O7
Mol. Mass.290.2698
SMILESCC(=O)N[C@@H]1[C@@H](N)C=C(O[C@H]1[C@H](O)[C@H](O)CO)C(O)=O