Reaction Details
TargetNeuronal acetylcholine receptor subunit alpha-7
LigandBDBM50428086
Substrate/Competitorn/a
Meas. Tech.ChEMBL_941648 (CHEMBL2330766)
Ki 67000±n/a nM
Citation Liu, YRichardson, JTran, TAl-Muhtasib, NXie, TYenugonda, VMSexton, HGRezvani, AHLevin, EDSahibzada, NKellar, KJBrown, MLXiao, YPaige, M Chemistry and pharmacological studies of 3-alkoxy-2,5-disubstituted-pyridinyl compounds as novel selectivea4ß2 nicotinic acetylcholine receptor ligands that reduce alcohol intake in rats. J Med Chem56:3000-11 (2013) 
 
Neuronal acetylcholine receptor subunit alpha-7
Name:Neuronal acetylcholine receptor subunit alpha-7
Type:Enzyme
Mol. Mass.:56502.44
Organism:Rattus norvegicus (Rat)
Description:Q05941
Residue:502
BDBM50428086
NameBDBM50428086
Synonyms:CHEMBL2323572 | US9303017, (S)-21, YL-1-235
TypeSmall organic molecule
Emp. Form.C16H21ClN2O
Mol. Mass.292.804
SMILESCc1ncc(cc1OC[C@@H]1CCN1)C#CCCCCCl