Reaction Details
TargetSphingosine 1-phosphate receptor 1
LigandBDBM50428158
Substrate/Competitorn/a
Meas. Tech.ChEMBL_945997 (CHEMBL2341528)
EC50 16±n/a nM
Citation Pan, SGray, NSGao, WMi, YFan, YWang, XTuntland, TChe, JLefebvre, SChen, YChu, AHinterding, KGardin, AEnd, PHeining, PBruns, CCooke, NGNuesslein-Hildesheim, B Discovery of BAF312 (Siponimod), a Potent and Selective S1P Receptor Modulator. ACS Med Chem Lett4:333-7 (2013) 
 
Sphingosine 1-phosphate receptor 1
Name:Sphingosine 1-phosphate receptor 1
Type:Enzyme
Mol. Mass.:42836.02
Organism:Homo sapiens (Human)
Description:P21453
Residue:382
BDBM50428158
NameBDBM50428158
Synonyms:CHEMBL2336082
TypeSmall organic molecule
Emp. Form.C26H23F5N2O3
Mol. Mass.506.4644
SMILESC\C(=N/OCc1ccc(-c2ccc(F)c(F)c2)c(c1)C(F)(F)F)c1ccc(CNCCC(O)=O)cc1