Reaction Details
TargetSphingosine 1-phosphate receptor 1
LigandBDBM50428172
Substrate/Competitorn/a
Meas. Tech.ChEMBL_945997 (CHEMBL2341528)
EC50 300±n/a nM
Citation Pan, SGray, NSGao, WMi, YFan, YWang, XTuntland, TChe, JLefebvre, SChen, YChu, AHinterding, KGardin, AEnd, PHeining, PBruns, CCooke, NGNuesslein-Hildesheim, B Discovery of BAF312 (Siponimod), a Potent and Selective S1P Receptor Modulator. ACS Med Chem Lett4:333-7 (2013) 
 
Sphingosine 1-phosphate receptor 1
Name:Sphingosine 1-phosphate receptor 1
Type:Enzyme
Mol. Mass.:42836.02
Organism:Homo sapiens (Human)
Description:P21453
Residue:382
BDBM50428172
NameBDBM50428172
Synonyms:CHEMBL2336091
TypeSmall organic molecule
Emp. Form.C25H26N2O3
Mol. Mass.402.4855
SMILESC\C(=N/OCc1ccc(cc1)-c1ccccc1)c1ccc(CNCCC(O)=O)cc1