Reaction Details
TargetCannabinoid receptor 1
LigandBDBM50428182
Substrate/Competitorn/a
Meas. Tech.ChEMBL_946419 (CHEMBL2339599)
Ki 500±n/a nM
Citation Ouyang, QTong, QFeng, RMyint, KZYang, PXie, XQ Trisubstituted Sulfonamides: a New Chemotype for Development of Potent and Selective CB ACS Med Chem Lett4:387-392 (2013) 
 
Cannabinoid receptor 1
Name:Cannabinoid receptor 1
Type:G Protein-Coupled Receptor (GPCR)
Mol. Mass.:52868.96
Organism:Homo sapiens (Human)
Description:P21554
Residue:472
BDBM50428182
NameBDBM50428182
Synonyms:CHEMBL2336541
TypeSmall organic molecule
Emp. Form.C23H32N2O2S
Mol. Mass.400.577
SMILESCCN(CC)c1ccc(CN(C2CCCC2)S(=O)(=O)c2ccc(C)cc2)cc1