Reaction Details
TargetCannabinoid receptor 2
LigandBDBM50180022
Substrate/Competitorn/a
Meas. Tech.ChEMBL_946420 (CHEMBL2339600)
Ki 2.1±n/a nM
Citation Ouyang, QTong, QFeng, RMyint, KZYang, PXie, XQ Trisubstituted Sulfonamides: a New Chemotype for Development of Potent and Selective CB ACS Med Chem Lett4:387-392 (2013) 
 
Cannabinoid receptor 2
Name:Cannabinoid receptor 2
Type:G Protein-Coupled Receptor (GPCR)
Mol. Mass.:39690.94
Organism:Homo sapiens (Human)
Description:P34972
Residue:360
BDBM50180022
NameBDBM50180022
Synonyms:5-(4-chloro-3-methyl-phenyl)-1-(4-methyl-benzyl)-1H-pyrazole-3-carboxylic acid (1,3,3-trimethyl-bicyclo[2.2.1]hept-2-yl)-amide | CHEMBL381689
TypeSmall organic molecule
Emp. Form.C29H34ClN3O
Mol. Mass.476.053
SMILESCc1ccc(Cn2nc(cc2-c2ccc(Cl)c(C)c2)C(=O)NC2C3(C)CCC(C3)C2(C)C)cc1