Reaction Details
TargetCannabinoid receptor 2
LigandBDBM50428190
Substrate/Competitorn/a
Meas. Tech.ChEMBL_946420 (CHEMBL2339600)
Ki 46±n/a nM
Citation Ouyang, QTong, QFeng, RMyint, KZYang, PXie, XQ Trisubstituted Sulfonamides: a New Chemotype for Development of Potent and Selective CB ACS Med Chem Lett4:387-392 (2013) 
 
Cannabinoid receptor 2
Name:Cannabinoid receptor 2
Type:G Protein-Coupled Receptor (GPCR)
Mol. Mass.:39690.94
Organism:Homo sapiens (Human)
Description:P34972
Residue:360
BDBM50428190
NameBDBM50428190
Synonyms:CHEMBL2336566
TypeSmall organic molecule
Emp. Form.C25H30N2O3S
Mol. Mass.438.582
SMILESCCN(CC)c1ccc(CN(Cc2ccccc2)S(=O)(=O)c2ccc(OC)cc2)cc1