Reaction Details
TargetCannabinoid receptor 2
LigandBDBM50428191
Substrate/Competitorn/a
Meas. Tech.ChEMBL_946420 (CHEMBL2339600)
Ki 71±n/a nM
Citation Ouyang, QTong, QFeng, RMyint, KZYang, PXie, XQ Trisubstituted Sulfonamides: a New Chemotype for Development of Potent and Selective CB ACS Med Chem Lett4:387-392 (2013) 
 
Cannabinoid receptor 2
Name:Cannabinoid receptor 2
Type:G Protein-Coupled Receptor (GPCR)
Mol. Mass.:39690.94
Organism:Homo sapiens (Human)
Description:P34972
Residue:360
BDBM50428191
NameBDBM50428191
Synonyms:CHEMBL2336565
TypeSmall organic molecule
Emp. Form.C27H34N2O2S
Mol. Mass.450.636
SMILESCCN(CC)c1ccc(CN(Cc2ccccc2)S(=O)(=O)c2ccc(cc2)C(C)C)cc1