Reaction Details
TargetC-C chemokine receptor type 5
LigandBDBM50428329
Substrate/Competitorn/a
Meas. Tech.ChEMBL_947373 (CHEMBL2344606)
Ki 150±n/a nM
Citation Abdel-Magid, AF Targeting CCR2 Receptor To Treat Inflammation Diseases and Disorders. ACS Med Chem Lett4:371-2 (2013) 
 
C-C chemokine receptor type 5
Name:C-C chemokine receptor type 5
Type:Enzyme
Mol. Mass.:40540.21
Organism:Homo sapiens (Human)
Description:P51681
Residue:352
BDBM50428329
NameBDBM50428329
Synonyms:CHEMBL2338390
TypeSmall organic molecule
Emp. Form.C28H33F6N5O3
Mol. Mass.601.5837
SMILESCO[C@@H]1COCC[C@@H]1NC1CCN(CC1)C(=O)c1nc(nc(N2CCc3cc(ccc3C2)C(F)(F)F)c1C)C(F)(F)F