Reaction Details
TargetC-C chemokine receptor type 2
LigandBDBM50428327
Substrate/Competitorn/a
Meas. Tech.ChEMBL_947374 (CHEMBL2344607)
Ki 0.600000±n/a nM
Citation Abdel-Magid, AF Targeting CCR2 Receptor To Treat Inflammation Diseases and Disorders. ACS Med Chem Lett4:371-2 (2013) 
 
C-C chemokine receptor type 2
Name:C-C chemokine receptor type 2
Type:Enzyme
Mol. Mass.:41932.32
Organism:Homo sapiens (Human)
Description:P41597
Residue:374
BDBM50428327
NameBDBM50428327
Synonyms:CHEMBL2338392
TypeSmall organic molecule
Emp. Form.C24H30Cl2FN5O3
Mol. Mass.526.431
SMILESCO[C@@H]1COCC[C@@H]1NC1CCN(CC1)C(=O)c1nc(CF)nc(Nc2ccc(Cl)c(Cl)c2)c1C