Reaction Details
TargetC-C chemokine receptor type 2
LigandBDBM50428328
Substrate/Competitorn/a
Meas. Tech.ChEMBL_947374 (CHEMBL2344607)
Ki 1.000000±n/a nM
Citation Abdel-Magid, AF Targeting CCR2 Receptor To Treat Inflammation Diseases and Disorders. ACS Med Chem Lett4:371-2 (2013) 
 
C-C chemokine receptor type 2
Name:C-C chemokine receptor type 2
Type:Enzyme
Mol. Mass.:41932.32
Organism:Homo sapiens (Human)
Description:P41597
Residue:374
BDBM50428328
NameBDBM50428328
Synonyms:CHEMBL2338391
TypeSmall organic molecule
Emp. Form.C34H45F4N5O4
Mol. Mass.663.7458
SMILESCc1c(NC[C@H]2CCC[C@H](O2)c2ccc(cc2)C(F)(F)F)nc(nc1C(=O)N1CCC(CC1)N[C@H]1CCOC[C@H]1F)C1CCOCC1