Reaction Details
TargetNeuronal acetylcholine receptor subunit alpha-4/beta-2
LigandBDBM50428368
Substrate/Competitorn/a
Meas. Tech.ChEMBL_947916 (CHEMBL2343659)
Ki 94±n/a nM
Citation Tasso, BNovelli, FSparatore, FFasoli, FGotti, C (+)-Laburnamine, a natural selective ligand and partial agonist for the?4?2 nicotinic receptor subtype. J Nat Prod76:727-31 (2013) 
 
Neuronal acetylcholine receptor subunit alpha-4/beta-2
Name:Neuronal acetylcholine receptor subunit alpha-4/beta-2
Type:Protein
Mol. Mass.:n/a
Description:n/a
Components:This complex has 2 components.
Component 1
Name:Neuronal acetylcholine receptor subunit alpha-4
Synonyms:ACHA4_HUMAN CHRNA4 protein Neuronal acetylcholine receptor protein alpha-4 subunit Nicotinic acetylcholine receptor alpha4/beta2/alpha5
Type:n/a
Mol. Mass.:69963.49
Organism:Homo sapiens (Human)
Description:NACHRA4
Residue:627
Component 2
Name:Neuronal acetylcholine receptor subunit beta-2
Synonyms:ACHB2_HUMAN Neuronal acetylcholine receptor protein beta-2 subunit | Nicotinic acetylcholine receptor alpha3/beta2/alpha5
Type:Protein
Mol. Mass.:57020.50
Organism:Homo sapiens (Human)
Description:P17787
Residue:502
BDBM50428368
NameBDBM50428368
Synonyms:CHEMBL2332145
TypeSmall organic molecule
Emp. Form.C9H13NO
Mol. Mass.151.2056
SMILESCC(=O)C1=CC[C@@H]2CC[C@H]1N2