Reaction Details
TargetCarbonic anhydrase 7
LigandBDBM50336488
Substrate/Competitorn/a
Meas. Tech.ChEMBL_942104 (CHEMBL2340802)
Ki 7250±n/a nM
Citation Carta, FVullo, DMaresca, AScozzafava, ASupuran, CT Mono-/dihydroxybenzoic acid esters and phenol pyridinium derivatives as inhibitors of the mammalian carbonic anhydrase isoforms I, II, VII, IX, XII and XIV. Bioorg Med Chem21:1564-9 (2013) 
 
Carbonic anhydrase 7
Name:Carbonic anhydrase 7
Type:Enzyme
Mol. Mass.:29664.11
Organism:Homo sapiens (Human)
Description:Human cloned isozyme.
Residue:264
BDBM50336488
NameBDBM50336488
Synonyms:1,2-dimethoxybenzene | CHEMBL1668603
TypeSmall organic molecule
Emp. Form.C8H10O2
Mol. Mass.138.1638
SMILESCOc1ccccc1OC