Reaction Details
TargetCarbonic anhydrase 2
LigandBDBM50428395
Substrate/Competitorn/a
Meas. Tech.ChEMBL_942105 (CHEMBL2340803)
Ki 530±n/a nM
Citation Carta, FVullo, DMaresca, AScozzafava, ASupuran, CT Mono-/dihydroxybenzoic acid esters and phenol pyridinium derivatives as inhibitors of the mammalian carbonic anhydrase isoforms I, II, VII, IX, XII and XIV. Bioorg Med Chem21:1564-9 (2013) 
 
Carbonic anhydrase 2
Name:Carbonic anhydrase 2
Type:Enzyme
Mol. Mass.:29250.71
Organism:Homo sapiens (Human)
Description:P00918
Residue:260
BDBM50428395
NameBDBM50428395
Synonyms:CHEMBL2333588 | Isopropyl 2,6-Dihydroxybenzoate
TypeSmall organic molecule
Emp. Form.C10H12O4
Mol. Mass.196.1999
SMILESCC(C)OC(=O)c1c(O)cccc1O