Reaction Details
TargetCarbonic anhydrase 1
LigandBDBM50428394
Substrate/Competitorn/a
Meas. Tech.ChEMBL_942106 (CHEMBL2340804)
Ki 650±n/a nM
Citation Carta, FVullo, DMaresca, AScozzafava, ASupuran, CT Mono-/dihydroxybenzoic acid esters and phenol pyridinium derivatives as inhibitors of the mammalian carbonic anhydrase isoforms I, II, VII, IX, XII and XIV. Bioorg Med Chem21:1564-9 (2013) 
 
Carbonic anhydrase 1
Name:Carbonic anhydrase 1
Type:Enzyme
Mol. Mass.:28873.37
Organism:Homo sapiens (Human)
Description:P00915
Residue:261
BDBM50428394
NameBDBM50428394
Synonyms:CHEMBL486216 | Ethyl 3,4-Dihydroxybenzoate
TypeSmall organic molecule
Emp. Form.C9H10O4
Mol. Mass.182.1733
SMILESCCOC(=O)c1ccc(O)c(O)c1