Reaction Details
TargetCarbonic anhydrase 14
LigandBDBM50336492
Substrate/Competitorn/a
Meas. Tech.ChEMBL_942101 (CHEMBL2340799)
Ki 550±n/a nM
Citation Carta, FVullo, DMaresca, AScozzafava, ASupuran, CT Mono-/dihydroxybenzoic acid esters and phenol pyridinium derivatives as inhibitors of the mammalian carbonic anhydrase isoforms I, II, VII, IX, XII and XIV. Bioorg Med Chem21:1564-9 (2013) 
 
Carbonic anhydrase 14
Name:Carbonic anhydrase 14
Type:Enzyme
Mol. Mass.:37665.67
Organism:Homo sapiens (Human)
Description:Human (cloned) isozyme.
Residue:337
BDBM50336492
NameBDBM50336492
Synonyms:2,6-dimethoxybenzoic acid | CHEMBL488609
TypeSmall organic molecule
Emp. Form.C9H10O4
Mol. Mass.182.1733
SMILESCOc1cccc(OC)c1C(O)=O