Reaction Details
TargetCarbonic anhydrase 14
LigandBDBM50336489
Substrate/Competitorn/a
Meas. Tech.ChEMBL_942101 (CHEMBL2340799)
Ki 630±n/a nM
Citation Carta, FVullo, DMaresca, AScozzafava, ASupuran, CT Mono-/dihydroxybenzoic acid esters and phenol pyridinium derivatives as inhibitors of the mammalian carbonic anhydrase isoforms I, II, VII, IX, XII and XIV. Bioorg Med Chem21:1564-9 (2013) 
 
Carbonic anhydrase 14
Name:Carbonic anhydrase 14
Type:Enzyme
Mol. Mass.:37665.67
Organism:Homo sapiens (Human)
Description:Human (cloned) isozyme.
Residue:337
BDBM50336489
NameBDBM50336489
Synonyms:1,2,4-trimethoxybenzene | CHEMBL1668605
TypeSmall organic molecule
Emp. Form.C9H12O3
Mol. Mass.168.1898
SMILESCOc1ccc(OC)c(OC)c1