Reaction Details
TargetCarbonic anhydrase 9
LigandBDBM50362849
Substrate/Competitorn/a
Meas. Tech.ChEMBL_942103 (CHEMBL2340801)
Ki 680±n/a nM
Citation Carta, FVullo, DMaresca, AScozzafava, ASupuran, CT Mono-/dihydroxybenzoic acid esters and phenol pyridinium derivatives as inhibitors of the mammalian carbonic anhydrase isoforms I, II, VII, IX, XII and XIV. Bioorg Med Chem21:1564-9 (2013) 
 
Carbonic anhydrase 9
Name:Carbonic anhydrase 9
Type:Enzyme
Mol. Mass.:49669.03
Organism:Homo sapiens (Human)
Description:Catalytic domain of human cloned isozyme was used in the assay
Residue:459
BDBM50362849
NameBDBM50362849
Synonyms:CHEMBL1940391
TypeSmall organic molecule
Emp. Form.C12H14O3
Mol. Mass.206.2378
SMILESCC(C)OC(=O)\C=C\c1ccc(O)cc1