Reaction Details
TargetCarbonic anhydrase 1
LigandBDBM50428402
Substrate/Competitorn/a
Meas. Tech.ChEMBL_942114 (CHEMBL2341270)
Ki 5626±n/a nM
Citation Compain, GMartin-Mingot, AMaresca, AThibaudeau, SSupuran, CT Superacid synthesis of halogen containing N-substituted-4-aminobenzene sulfonamides: new selective tumor-associated carbonic anhydrase inhibitors. Bioorg Med Chem21:1555-63 (2013) 
 
Carbonic anhydrase 1
Name:Carbonic anhydrase 1
Type:Enzyme
Mol. Mass.:28873.37
Organism:Homo sapiens (Human)
Description:P00915
Residue:261
BDBM50428402
NameBDBM50428402
Synonyms:CHEMBL2333976
TypeSmall organic molecule
Emp. Form.C9H11ClN2O2S
Mol. Mass.246.714
SMILESNc1ccc(cc1)S(=O)(=O)NCC(Cl)=C