Reaction Details
TargetCarbonic anhydrase 1
LigandBDBM50349850
Substrate/Competitorn/a
Meas. Tech.ChEMBL_942114 (CHEMBL2341270)
Ki 1098±n/a nM
Citation Compain, GMartin-Mingot, AMaresca, AThibaudeau, SSupuran, CT Superacid synthesis of halogen containing N-substituted-4-aminobenzene sulfonamides: new selective tumor-associated carbonic anhydrase inhibitors. Bioorg Med Chem21:1555-63 (2013) 
 
Carbonic anhydrase 1
Name:Carbonic anhydrase 1
Type:Enzyme
Mol. Mass.:28873.37
Organism:Homo sapiens (Human)
Description:P00915
Residue:261
BDBM50349850
NameBDBM50349850
Synonyms:CHEMBL1738787
TypeSmall organic molecule
Emp. Form.C11H13ClN6O3S
Mol. Mass.344.777
SMILESNS(=O)(=O)c1ccc(Nc2nc(Cl)nc(NCCO)n2)cc1