Reaction Details
TargetCarbonic anhydrase 12
LigandBDBM50428406
Substrate/Competitorn/a
Meas. Tech.ChEMBL_942111 (CHEMBL2340809)
Ki 1521±n/a nM
Citation Compain, GMartin-Mingot, AMaresca, AThibaudeau, SSupuran, CT Superacid synthesis of halogen containing N-substituted-4-aminobenzene sulfonamides: new selective tumor-associated carbonic anhydrase inhibitors. Bioorg Med Chem21:1555-63 (2013) 
 
Carbonic anhydrase 12
Name:Carbonic anhydrase 12
Type:Enzyme
Mol. Mass.:39456.00
Organism:Homo sapiens (Human)
Description:Catalytic domain of human cloned isozyme was used in the assay
Residue:354
BDBM50428406
NameBDBM50428406
Synonyms:CHEMBL2333972
TypeSmall organic molecule
Emp. Form.C9H12ClFN2O2S
Mol. Mass.266.72
SMILESCC(F)(Cl)CNS(=O)(=O)c1ccc(N)cc1