Reaction Details
TargetCarbonic anhydrase 9
LigandBDBM50428399
Substrate/Competitorn/a
Meas. Tech.ChEMBL_942112 (CHEMBL2340810)
Ki 1398±n/a nM
Citation Compain, GMartin-Mingot, AMaresca, AThibaudeau, SSupuran, CT Superacid synthesis of halogen containing N-substituted-4-aminobenzene sulfonamides: new selective tumor-associated carbonic anhydrase inhibitors. Bioorg Med Chem21:1555-63 (2013) 
 
Carbonic anhydrase 9
Name:Carbonic anhydrase 9
Type:Enzyme
Mol. Mass.:49669.03
Organism:Homo sapiens (Human)
Description:Catalytic domain of human cloned isozyme was used in the assay
Residue:459
BDBM50428399
NameBDBM50428399
Synonyms:4-(Allylamino)Benzenesulfonamide | CHEMBL2333964
TypeSmall organic molecule
Emp. Form.C9H12N2O2S
Mol. Mass.212.269
SMILESNS(=O)(=O)c1ccc(NCC=C)cc1