Reaction Details
TargetCarbonic anhydrase 2
LigandBDBM50428408
Substrate/Competitorn/a
Meas. Tech.ChEMBL_942113 (CHEMBL2341269)
Ki 75±n/a nM
Citation Compain, GMartin-Mingot, AMaresca, AThibaudeau, SSupuran, CT Superacid synthesis of halogen containing N-substituted-4-aminobenzene sulfonamides: new selective tumor-associated carbonic anhydrase inhibitors. Bioorg Med Chem21:1555-63 (2013) 
 
Carbonic anhydrase 2
Name:Carbonic anhydrase 2
Type:Enzyme
Mol. Mass.:29250.71
Organism:Homo sapiens (Human)
Description:P00918
Residue:260
BDBM50428408
NameBDBM50428408
Synonyms:CHEMBL2333970
TypeSmall organic molecule
Emp. Form.C10H15FN2O2S
Mol. Mass.246.302
SMILESCC(C)(F)CNS(=O)(=O)c1ccc(N)cc1