Reaction Details
TargetCarbonic anhydrase 2
LigandBDBM50428410
Substrate/Competitorn/a
Meas. Tech.ChEMBL_942113 (CHEMBL2341269)
Ki 3455±n/a nM
Citation Compain, GMartin-Mingot, AMaresca, AThibaudeau, SSupuran, CT Superacid synthesis of halogen containing N-substituted-4-aminobenzene sulfonamides: new selective tumor-associated carbonic anhydrase inhibitors. Bioorg Med Chem21:1555-63 (2013) 
 
Carbonic anhydrase 2
Name:Carbonic anhydrase 2
Type:Enzyme
Mol. Mass.:29250.71
Organism:Homo sapiens (Human)
Description:P00918
Residue:260
BDBM50428410
NameBDBM50428410
Synonyms:CHEMBL2333968
TypeSmall organic molecule
Emp. Form.C9H14N2O2S
Mol. Mass.214.285
SMILESCCCNS(=O)(=O)c1ccc(N)cc1