Reaction Details
TargetCarbonic anhydrase 13
LigandBDBM50428421
Substrate/Competitorn/a
Meas. Tech.ChEMBL_942126 (CHEMBL2341282)
Ki>100000±n/a nM
Citation Davis, RAVullo, DMaresca, ASupuran, CTPoulsen, SA Natural product coumarins that inhibit human carbonic anhydrases. Bioorg Med Chem21:1539-43 (2013) 
 
Carbonic anhydrase 13
Name:Carbonic anhydrase 13
Type:Enzyme
Mol. Mass.:29445.78
Organism:Homo sapiens (Human)
Description:Q8N1Q1
Residue:262
BDBM50428421
NameBDBM50428421
Synonyms:CHEMBL2334350
TypeSmall organic molecule
Emp. Form.C16H16O5
Mol. Mass.288.2952
SMILESCOc1c2OC(C)(C)C=Cc2c(OC)c2ccc(=O)oc12