Reaction Details
TargetCarbonic anhydrase 2
LigandBDBM50428426
Substrate/Competitorn/a
Meas. Tech.ChEMBL_942130 (CHEMBL2341286)
Ki>100000±n/a nM
Citation Davis, RAVullo, DMaresca, ASupuran, CTPoulsen, SA Natural product coumarins that inhibit human carbonic anhydrases. Bioorg Med Chem21:1539-43 (2013) 
 
Carbonic anhydrase 2
Name:Carbonic anhydrase 2
Type:Enzyme
Mol. Mass.:29250.71
Organism:Homo sapiens (Human)
Description:P00918
Residue:260
BDBM50428426
NameBDBM50428426
Synonyms:CHEMBL2334354
TypeSmall organic molecule
Emp. Form.C17H12O8
Mol. Mass.344.2724
SMILESCOc1cc2c3c(oc(=O)c4cc(OC)c(OC)c(oc2=O)c34)c1O